{"text_format":"1","workbook":"xlsx","n_sheets":8,"sheets":["Instructions","Calculator","Calculations","Benefits","Funding & Contributions","Selected Options","Allowed Costs","Client Notes"],"not_rendered":{"charts":1,"images":1,"macros":1,"external_links":0,"defined_names":3,"comments":0,"pivot_tables":0},"unopened":[],"bounds":{"document_bytes":16777216,"sheet_cells":100000,"rows_first":2000,"rows_last":500,"rows_between":2000,"halvings":0,"cell_chars":16384,"cell_head_chars":4096},"cells_cut":0,"cells_raw":0,"read":"whole","date_system":"1900"}

{"sheet":"Instructions","index":0,"n_rows":0,"n_cols":0,"rows_kept":0,"cut":false,"hidden":false,"merged":[]}

{"sheet":"Calculator","index":1,"n_rows":70,"n_cols":33,"rows_kept":70,"cut":false,"hidden":false,"merged":[[58,23,58,28],[42,7,42,8],[42,21,42,22],[42,16,46,19],[34,21,34,22],[36,21,36,22],[44,21,44,22],[46,21,46,22],[32,16,36,19],[54,21,54,22],[38,1,39,28],[52,7,52,8],[50,2,54,5],[46,7,46,8],[42,2,46,5],[34,7,34,8],[28,21,28,22],[32,21,32,22],[36,7,36,8],[24,7,24,8],[26,7,26,8],[28,7,28,8],[32,7,32,8],[44,7,44,8],[24,2,28,5],[24,16,28,19],[12,1,13,14],[12,15,13,28],[16,7,16,8],[20,7,20,8],[18,7,18,8],[20,21,20,22],[16,2,20,5],[16,16,20,19],[16,21,16,22],[18,21,18,22],[32,2,36,5],[24,21,24,22],[26,21,26,22],[50,7,50,8],[54,7,54,8],[50,21,50,22],[52,21,52,22],[50,16,55,19],[6,6,6,9],[6,10,6,15],[8,11,8,16],[6,19,9,27],[6,2,6,5]]}
[]
[]
[]
[null,"2020-21 Plan Comparison Calculator"]
[]
[null,null,"Step 1: Who will be covered?",null,null,null,null,null,null,null,null,null,null,null,null,null,null,null,null,null,null,"Expected Utilization"]
[null,null,"Coverage Level",null,null,null,"Region/State \nWhere you live",null,null,null,"Full Time or Part Time?",null,null,null,null,null,null,null,null,"Optional:  You can select a pre-defined expected utilization for the upcoming plan year.  This will automatically populate certain areas in the calculator depending on the level of utilization selected.  Each slider can be modified after a selection has been made, if necessary."]
[]
[null,null,null,null,null,null,null,null,null,null,null,null,null,null,null,null,null,null,null,null,null,null,null,null,null,null,null,null,null,null,null,null,{"$f":"+'Selected Options'!G3","v":1}]
[]
[]
[null,null,{"$f":"+IF('Selected Options'!$G$3=1,\"Step 2:  What are your anticipated health care needs for the year?\",\"Step 2:  What are you and your dependents anticipated health care needs for the year?\")","v":"Step 2:  What are your anticipated health care needs for the year?"}]
[null,"Doctor Visits & Lab",null,null,null,null,null,null,null,null,null,null,null,null,null,"Prescription Drug"]
[]
[null,null,"Primary Care Office Visits (non-preventive)",null,null,null,null,null,null,null,null,null,null,"Visits",null,null,"Tier 1 - Generic Rx",null,null,null,null,null,null,null,null,null,null,"Scripts"]
[]
[null,null,{"$f":"+CONCATENATE(\"Labs and other procedures performed in physician's office are not included. Assumes \",TEXT('Allowed Costs'!B4,\"$0\"),\" per visit.\")","v":"Labs and other procedures performed in physician's office are not included. Assumes $140 per visit."},null,null,null,null,"You",null,null,null,null,null,0,null,null,{"$f":"+CONCATENATE(\"Enter the total # of annual generic scripts expected.  Calculator assumes \",TEXT('Allowed Costs'!$B$11,\"$0\"),\"/script.\")","v":"Enter the total # of annual generic scripts expected.  Calculator assumes $35/script."},null,null,null,null,"You",null,null,null,null,null,0]
[]
[null,null,null,null,null,null,null,{"$f":"+IF('Selected Options'!$G$3=1,\"\",(IF('Selected Options'!$G$3=2,\"Spouse\",IF('Selected Options'!$G$3=3,\"Child\",(IF('Selected Options'!$G$3=4,\"Spouse\",(IF('Selected Options'!$G$3=5,\"Spouse\",\"Dependent\"))))))))","v":""},null,null,null,null,null,0,null,null,null,null,null,null,null,{"$f":"+IF('Selected Options'!$G$3=1,\"\",(IF('Selected Options'!$G$3=2,\"Spouse\",IF('Selected Options'!$G$3=3,\"Child\",(IF('Selected Options'!$G$3=4,\"Spouse\",(IF('Selected Options'!$G$3=5,\"Spouse\",\"Dependent\"))))))))","v":""},null,null,null,null,null,0]
[]
{"$rows_left_out":51}
{"sheet":"Calculations","index":2,"n_rows":216,"n_cols":23,"rows_kept":216,"cut":false,"hidden":true,"merged":[[206,11,206,12],[203,11,203,12],[131,11,131,12],[134,11,134,12],[59,11,59,12],[62,11,62,12],[59,2,59,8],[63,2,63,8],[67,2,67,8],[211,2,211,8],[207,2,207,8],[203,2,203,8],[131,2,131,8],[135,2,135,8],[139,2,139,8]]}
[]
[{"$f":"+Benefits!B2","v":"Buy-Up"},null,"Copay Amount","Copay","Ded Only","Coins Only","Ded/Coins","Copay, Coins","Copay, D/C","Copay Amount",null,"Units","Total Charges",null,"Copay","Ded Only","Coins Only","Ded/Coins","Copay, Coins","Copay, D/C","Total",null,"OOPM Accum"]
[{"$f":"+Calculator!H17","v":"You"},"Services"]
[null,"PCP",{"$f":"+Benefits!B14","v":20},{"$f":"+Benefits!C14","v":"Y"},{"$f":"+IF(AND(Benefits!$C14=\"N\",Benefits!$D14=\"Y\",Benefits!$E14=\"N\"),\"Y\",\"N\")","v":"N"},{"$f":"+IF(AND(Benefits!$C14=\"N\",Benefits!$D14=\"N\",Benefits!$E14=\"Y\"),\"Y\",\"N\")","v":"N"},{"$f":"+IF(AND(Benefits!$C14=\"N\",Benefits!$D14=\"Y\",Benefits!$E14=\"Y\"),\"Y\",\"N\")","v":"N"},{"$f":"+IF(AND(Benefits!$C14=\"Y\",Benefits!$D14=\"N\",Benefits!$E14=\"Y\"),\"Y\",\"N\")","v":"N"},{"$f":"+IF(AND(Benefits!$C14=\"Y\",Benefits!$D14=\"Y\",Benefits!$E14=\"Y\"),\"Y\",\"N\")","v":"N"},{"$f":"+C4","v":20},null,{"$f":"+Calculator!N17","v":0},{"$f":"+L4*'Allowed Costs'!$B$4","v":0},null,{"$f":"+IF(OR(D4=\"Y\",I4=\"Y\"),L4*C4,0)","v":0},{"$f":"+IF(E4=\"Y\",M4,0)","v":0},{"$f":"+IF(F4=\"Y\",M4,0)","v":0},{"$f":"+IF(G4=\"Y\",M4,0)","v":0},{"$f":"+IF(H4=\"Y\",IF((M4-(L4*J4))>0,M4-(L4*J4),0),0)","v":0},{"$f":"+IF(I4=\"Y\",IF((M4-(L4*J4))>0,M4-(L4*J4),0),0)","v":0},{"$f":"IF(W4=\"Y\",SUM(O4:T4),0)","v":0},null,{"$f":"+Benefits!F14","v":"Y"}]
[null,"SCP",{"$f":"+Benefits!B15","v":40},{"$f":"+Benefits!C15","v":"Y"},{"$f":"+IF(AND(Benefits!$C15=\"N\",Benefits!$D15=\"Y\",Benefits!$E15=\"N\"),\"Y\",\"N\")","v":"N"},{"$f":"+IF(AND(Benefits!$C15=\"N\",Benefits!$D15=\"N\",Benefits!$E15=\"Y\"),\"Y\",\"N\")","v":"N"},{"$f":"+IF(AND(Benefits!$C15=\"N\",Benefits!$D15=\"Y\",Benefits!$E15=\"Y\"),\"Y\",\"N\")","v":"N"},{"$f":"+IF(AND(Benefits!$C15=\"Y\",Benefits!$D15=\"N\",Benefits!$E15=\"Y\"),\"Y\",\"N\")","v":"N"},{"$f":"+IF(AND(Benefits!$C15=\"Y\",Benefits!$D15=\"Y\",Benefits!$E15=\"Y\"),\"Y\",\"N\")","v":"N"},40,null,{"$f":"+Calculator!N25","v":0},{"$f":"+L5*'Allowed Costs'!$B$5","v":0},null,{"$f":"+IF(OR(D5=\"Y\",I5=\"Y\"),L5*C5,0)","v":0},{"$f":"+IF(E5=\"Y\",M5,0)","v":0},{"$f":"+IF(F5=\"Y\",M5,0)","v":0},{"$f":"+IF(G5=\"Y\",M5,0)","v":0},{"$f":"+IF(H5=\"Y\",IF((M5-(L5*J5))>0,M5-(L5*J5),0),0)","v":0},{"$f":"+IF(I5=\"Y\",IF((M5-(L5*J5))>0,M5-(L5*J5),0),0)","v":0},0,null,{"$f":"+Benefits!F15","v":"Y"}]
[null,"Lab/X-ray",{"$f":"+Benefits!B16","v":0},{"$f":"+Benefits!C16","v":"N"},{"$f":"+IF(AND(Benefits!$C16=\"N\",Benefits!$D16=\"Y\",Benefits!$E16=\"N\"),\"Y\",\"N\")","v":"N"},{"$f":"+IF(AND(Benefits!$C16=\"N\",Benefits!$D16=\"N\",Benefits!$E16=\"Y\"),\"Y\",\"N\")","v":"N"},{"$f":"+IF(AND(Benefits!$C16=\"N\",Benefits!$D16=\"Y\",Benefits!$E16=\"Y\"),\"Y\",\"N\")","v":"Y"},{"$f":"+IF(AND(Benefits!$C16=\"Y\",Benefits!$D16=\"N\",Benefits!$E16=\"Y\"),\"Y\",\"N\")","v":"N"},{"$f":"+IF(AND(Benefits!$C16=\"Y\",Benefits!$D16=\"Y\",Benefits!$E16=\"Y\"),\"Y\",\"N\")","v":"N"},0,null,{"$f":"+Calculator!N33","v":0},{"$f":"+L6*'Allowed Costs'!$B$6","v":0},null,0,0,0,0,0,0,0,null,{"$f":"+Benefits!F16","v":"Y"}]
[null,"IP",{"$f":"+Benefits!B17","v":200},{"$f":"+Benefits!C17","v":"Y"},{"$f":"+IF(AND(Benefits!$C17=\"N\",Benefits!$D17=\"Y\",Benefits!$E17=\"N\"),\"Y\",\"N\")","v":"N"},{"$f":"+IF(AND(Benefits!$C17=\"N\",Benefits!$D17=\"N\",Benefits!$E17=\"Y\"),\"Y\",\"N\")","v":"N"},{"$f":"+IF(AND(Benefits!$C17=\"N\",Benefits!$D17=\"Y\",Benefits!$E17=\"Y\"),\"Y\",\"N\")","v":"N"},{"$f":"+IF(AND(Benefits!$C17=\"Y\",Benefits!$D17=\"N\",Benefits!$E17=\"Y\"),\"Y\",\"N\")","v":"N"},{"$f":"+IF(AND(Benefits!$C17=\"Y\",Benefits!$D17=\"Y\",Benefits!$E17=\"Y\"),\"Y\",\"N\")","v":"N"},200,null,{"$f":"+Calculator!N43","v":0},{"$f":"+L7*'Allowed Costs'!$B$7","v":0},null,{"$f":"+IF(OR(D7=\"Y\",I7=\"Y\"),L7*C7,0)","v":0},0,0,0,0,0,{"$f":"IF(W7=\"Y\",SUM(O7:T7),0)","v":0},null,{"$f":"+Benefits!F17","v":"Y"}]
[null,"OP",{"$f":"+Benefits!B18","v":0},{"$f":"+Benefits!C18","v":"N"},{"$f":"+IF(AND(Benefits!$C18=\"N\",Benefits!$D18=\"Y\",Benefits!$E18=\"N\"),\"Y\",\"N\")","v":"N"},{"$f":"+IF(AND(Benefits!$C18=\"N\",Benefits!$D18=\"N\",Benefits!$E18=\"Y\"),\"Y\",\"N\")","v":"N"},{"$f":"+IF(AND(Benefits!$C18=\"N\",Benefits!$D18=\"Y\",Benefits!$E18=\"Y\"),\"Y\",\"N\")","v":"Y"},{"$f":"+IF(AND(Benefits!$C18=\"Y\",Benefits!$D18=\"N\",Benefits!$E18=\"Y\"),\"Y\",\"N\")","v":"N"},{"$f":"+IF(AND(Benefits!$C18=\"Y\",Benefits!$D18=\"Y\",Benefits!$E18=\"Y\"),\"Y\",\"N\")","v":"N"},0,null,{"$f":"+Calculator!N51","v":0},{"$f":"+L8*'Allowed Costs'!$B$8","v":0},null,0,0,0,0,0,0,0,null,{"$f":"+Benefits!F18","v":"Y"}]
[null,"ER",{"$f":"+Benefits!B19","v":150},{"$f":"+Benefits!C19","v":"Y"},{"$f":"+IF(AND(Benefits!$C19=\"N\",Benefits!$D19=\"Y\",Benefits!$E19=\"N\"),\"Y\",\"N\")","v":"N"},{"$f":"+IF(AND(Benefits!$C19=\"N\",Benefits!$D19=\"N\",Benefits!$E19=\"Y\"),\"Y\",\"N\")","v":"N"},{"$f":"+IF(AND(Benefits!$C19=\"N\",Benefits!$D19=\"Y\",Benefits!$E19=\"Y\"),\"Y\",\"N\")","v":"N"},{"$f":"+IF(AND(Benefits!$C19=\"Y\",Benefits!$D19=\"N\",Benefits!$E19=\"Y\"),\"Y\",\"N\")","v":"Y"},{"$f":"+IF(AND(Benefits!$C19=\"Y\",Benefits!$D19=\"Y\",Benefits!$E19=\"Y\"),\"Y\",\"N\")","v":"N"},150,null,{"$f":"+Calculator!AB43","v":0},{"$f":"+L9*'Allowed Costs'!$B$9","v":0},null,0,0,0,0,0,0,0,null,{"$f":"+Benefits!F19","v":"Y"}]
[null,"Telemedicine",{"$f":"+Benefits!B20","v":5},{"$f":"+Benefits!C20","v":"Y"},{"$f":"+IF(AND(Benefits!$C20=\"N\",Benefits!$D20=\"Y\",Benefits!$E20=\"N\"),\"Y\",\"N\")","v":"N"},{"$f":"+IF(AND(Benefits!$C20=\"N\",Benefits!$D20=\"N\",Benefits!$E20=\"Y\"),\"Y\",\"N\")","v":"N"},{"$f":"+IF(AND(Benefits!$C20=\"N\",Benefits!$D20=\"Y\",Benefits!$E20=\"Y\"),\"Y\",\"N\")","v":"N"},{"$f":"+IF(AND(Benefits!$C20=\"Y\",Benefits!$D20=\"N\",Benefits!$E20=\"Y\"),\"Y\",\"N\")","v":"N"},{"$f":"+IF(AND(Benefits!$C20=\"Y\",Benefits!$D20=\"Y\",Benefits!$E20=\"Y\"),\"Y\",\"N\")","v":"N"},5,null,{"$f":"+Calculator!AB51","v":0},{"$f":"+L10*'Allowed Costs'!$B$14","v":0},null,{"$f":"+IF(OR(D10=\"Y\",I10=\"Y\"),L10*C10,0)","v":0},0,0,0,0,0,0,null,{"$f":"+Benefits!F20","v":"Y"}]
[null,"Rx"]
[null,"Tier 1",{"$f":"+Benefits!B22","v":10},{"$f":"+Benefits!C22","v":"Y"},{"$f":"+IF(AND(Benefits!$C22=\"N\",Benefits!$D22=\"Y\",Benefits!$E22=\"N\"),\"Y\",\"N\")","v":"N"},{"$f":"+IF(AND(Benefits!$C22=\"N\",Benefits!$D22=\"N\",Benefits!$E22=\"Y\"),\"Y\",\"N\")","v":"N"},{"$f":"+IF(AND(Benefits!$C22=\"N\",Benefits!$D22=\"Y\",Benefits!$E22=\"Y\"),\"Y\",\"N\")","v":"N"},{"$f":"+IF(AND(Benefits!$C22=\"Y\",Benefits!$D22=\"N\",Benefits!$E22=\"Y\"),\"Y\",\"N\")","v":"N"},{"$f":"+IF(AND(Benefits!$C22=\"Y\",Benefits!$D22=\"Y\",Benefits!$E22=\"Y\"),\"Y\",\"N\")","v":"N"},{"$f":"+C12","v":10},null,{"$f":"+Calculator!AB17","v":0},{"$f":"+L12*'Allowed Costs'!$B$11","v":0},null,{"$f":"+IF(OR(D12=\"Y\",I12=\"Y\"),L12*C12,0)","v":0},{"$f":"+IF(E12=\"Y\",M12,0)","v":0},{"$f":"+IF(F12=\"Y\",M12,0)","v":0},{"$f":"+IF(G12=\"Y\",M12,0)","v":0},{"$f":"+IF(H12=\"Y\",IF((M12-(L12*J12))>0,M12-(L12*J12),0),0)","v":0},{"$f":"+IF(I12=\"Y\",IF((M12-(L12*J12))>0,M12-(L12*J12),0),0)","v":0},{"$f":"IF(W12=\"Y\",SUM(O12:T12),0)","v":0},null,{"$f":"+Benefits!F22","v":"Y"}]
[null,"Tier 2",{"$f":"+Benefits!B23","v":35},{"$f":"+Benefits!C23","v":"Y"},{"$f":"+IF(AND(Benefits!$C23=\"N\",Benefits!$D23=\"Y\",Benefits!$E23=\"N\"),\"Y\",\"N\")","v":"N"},{"$f":"+IF(AND(Benefits!$C23=\"N\",Benefits!$D23=\"N\",Benefits!$E23=\"Y\"),\"Y\",\"N\")","v":"N"},{"$f":"+IF(AND(Benefits!$C23=\"N\",Benefits!$D23=\"Y\",Benefits!$E23=\"Y\"),\"Y\",\"N\")","v":"N"},{"$f":"+IF(AND(Benefits!$C23=\"Y\",Benefits!$D23=\"N\",Benefits!$E23=\"Y\"),\"Y\",\"N\")","v":"N"},{"$f":"+IF(AND(Benefits!$C23=\"Y\",Benefits!$D23=\"Y\",Benefits!$E23=\"Y\"),\"Y\",\"N\")","v":"N"},{"$f":"+C13","v":35},null,{"$f":"+Calculator!AB25","v":0},{"$f":"+L13*'Allowed Costs'!$B$12","v":0},null,{"$f":"+IF(OR(D13=\"Y\",I13=\"Y\"),L13*C13,0)","v":0},{"$f":"+IF(E13=\"Y\",M13,0)","v":0},{"$f":"+IF(F13=\"Y\",M13,0)","v":0},{"$f":"+IF(G13=\"Y\",M13,0)","v":0},{"$f":"+IF(H13=\"Y\",IF((M13-(L13*J13))>0,M13-(L13*J13),0),0)","v":0},{"$f":"+IF(I13=\"Y\",IF((M13-(L13*J13))>0,M13-(L13*J13),0),0)","v":0},{"$f":"IF(W13=\"Y\",SUM(O13:T13),0)","v":0},null,{"$f":"+Benefits!F23","v":"Y"}]
[null,"Tier 3",{"$f":"+Benefits!B24","v":55},{"$f":"+Benefits!C24","v":"Y"},{"$f":"+IF(AND(Benefits!$C24=\"N\",Benefits!$D24=\"Y\",Benefits!$E24=\"N\"),\"Y\",\"N\")","v":"N"},{"$f":"+IF(AND(Benefits!$C24=\"N\",Benefits!$D24=\"N\",Benefits!$E24=\"Y\"),\"Y\",\"N\")","v":"N"},{"$f":"+IF(AND(Benefits!$C24=\"N\",Benefits!$D24=\"Y\",Benefits!$E24=\"Y\"),\"Y\",\"N\")","v":"N"},{"$f":"+IF(AND(Benefits!$C24=\"Y\",Benefits!$D24=\"N\",Benefits!$E24=\"Y\"),\"Y\",\"N\")","v":"N"},{"$f":"+IF(AND(Benefits!$C24=\"Y\",Benefits!$D24=\"Y\",Benefits!$E24=\"Y\"),\"Y\",\"N\")","v":"N"},{"$f":"+C14","v":55},null,{"$f":"+Calculator!AB33","v":0},{"$f":"+L14*'Allowed Costs'!$B$13","v":0},null,{"$f":"+IF(OR(D14=\"Y\",I14=\"Y\"),L14*C14,0)","v":0},{"$f":"+IF(E14=\"Y\",M14,0)","v":0},{"$f":"+IF(F14=\"Y\",M14,0)","v":0},{"$f":"+IF(G14=\"Y\",M14,0)","v":0},{"$f":"+IF(H14=\"Y\",IF((M14-(L14*J14))>0,M14-(L14*J14),0),0)","v":0},{"$f":"+IF(I14=\"Y\",IF((M14-(L14*J14))>0,M14-(L14*J14),0),0)","v":0},{"$f":"IF(W14=\"Y\",SUM(O14:T14),0)","v":0},null,{"$f":"+Benefits!F24","v":"Y"}]
[]
[null,null,"HRA/HSA","All Copays",null,"Deductible","Coins After Ded","Total Coins","EE Paid Coins","Subject to OOP",null,null,null,null,{"$f":"+SUM(O4:O14)","v":0},0,0,0,0,0,{"$f":"+SUM(U4:U14)","v":0}]
[null,"Amounts",{"$f":"+D17+E17+F17+I17","v":0},{"$f":"+SUM(O4:O14)","v":0},null,{"$f":"+P16+R16+T16","v":0},{"$f":"+IF(F17>F18,F17-F18,0)","v":0},{"$f":"+Q16+S16+G17","v":0},{"$f":"+H17*(1-Benefits!$B$6)","v":0},{"$f":"+U16","v":0}]
[null,"Limits",{"$f":"+Benefits!B11","v":0},{"$f":"+Benefits!$B$7-Calculations!F19-Calculations!I19","v":3250},null,{"$f":"+IF(OR('Selected Options'!$G$3=1,Benefits!$B$12=\"Embedded\"),Benefits!$B$4,Benefits!$B$5)","v":750},null,null,{"$f":"Benefits!$B$7-F18","v":2500},{"$f":"+I18+F18","v":3250}]
[null,"Utilized",{"$f":"IF((F19+I19)<C18,F19+I19,C18)","v":0},{"$f":"+MIN(D17,D18)","v":0},null,{"$f":"+MIN(F17,F18)","v":0},null,null,{"$f":"+MIN(I17,I18)","v":0},{"$f":"+MIN(J17,J18)","v":0}]
[]
{"$rows_left_out":197}
{"sheet":"Benefits","index":3,"n_rows":30,"n_cols":18,"rows_kept":30,"cut":false,"hidden":true,"merged":[]}
[null,null,null,null,null,null,null,null,null,null,null,null,null,null,null,null,null,"Embedded"]
["Option",{"$f":"+'Funding & Contributions'!A27","v":"Buy-Up"},null,null,null,null,{"$f":"+'Funding & Contributions'!A28","v":"Core"},null,null,null,null,{"$f":"+'Funding & Contributions'!A29","v":"HDHP"},null,null,null,null,null,"Aggregate"]
[]
["Deductible",750,null,null,null,null,1000,null,null,null,null,1500,"Aggregate"]
["Family Deductible",1500,null,null,null,null,2000,null,null,null,null,3000,"Aggregate"]
["Coinsurance",0.8,null,null,null,null,0.7,null,null,null,null,0.75]
["OOPM",3250,null,null,null,null,5250,null,null,null,null,6350,"Embedded"]
["Family OOPM",6500,null,null,null,null,10500,null,null,null,null,12700,"Embedded"]
["HRA/HSA?",{"$f":"+INDEX('Funding & Contributions'!$C$7:$C$11,MATCH('Funding & Contributions'!$B$3,'Funding & Contributions'!$A$7:$A$11,0))","v":0},null,null,null,null,{"$f":"+INDEX('Funding & Contributions'!$C$13:$C$17,MATCH('Funding & Contributions'!$B$3,'Funding & Contributions'!$A$13:$A$17,0))","v":0},null,null,null,null,{"$f":"+INDEX('Funding & Contributions'!$C$19:$C$23,MATCH('Funding & Contributions'!$B$3,'Funding & Contributions'!$A$19:$A$23,0))","v":1E-3}]
["HRA/HSA rollover",{"$f":"+IF('Funding & Contributions'!C7>0,Calculator!$Q$9,0)","v":0},null,null,null,null,{"$f":"+IF('Funding & Contributions'!C13>0,Calculator!$L$9,0)","v":0},null,null,null,null,{"$f":"+IF('Funding & Contributions'!C19>0,Calculator!$L$9,0)","v":0}]
["Total HRA/HSA",{"$f":"+SUM(B9:B10)","v":0},null,null,null,null,{"$f":"+SUM(G9:G10)","v":0},null,null,null,null,{"$f":"+SUM(L9:L10)","v":1E-3}]
["Deductible Type?","Embedded",null,null,null,null,"Embedded",null,null,null,null,"Aggregate"]
["Services","Copays","Copay Applies","Ded Applies","Coins Applies","OOPM Accum","Copays","Copay Applies","Ded Applies","Coins Applies","OOPM Accum","Copays","Copay Applies","Ded Applies","Coins Applies","OOPM Accum"]
["PCP",20,"Y","N","N","Y",30,"Y","N","N","Y",0,"N","Y","Y","Y"]
["SCP",40,"Y","N","N","Y",50,"Y","N","N","Y",0,"N","Y","Y","Y"]
["Lab/X-ray",0,"N","Y","Y","Y",0,"N","Y","Y","Y",0,"N","Y","Y","Y"]
["IP",200,"Y","N","N","Y",250,"Y","N","N","Y",0,"N","Y","Y","Y"]
["OP",0,"N","Y","Y","Y",0,"N","Y","Y","Y",0,"N","Y","Y","Y"]
["ER",150,"Y","N","Y","Y",150,"Y","N","Y","Y",0,"N","Y","Y","Y"]
["Telemedicine",5,"Y","N","N","Y",5,"Y","N","N","Y",0,"N","Y","Y","Y"]
{"$rows_left_out":11}
{"sheet":"Funding & Contributions","index":4,"n_rows":43,"n_cols":21,"rows_kept":43,"cut":false,"hidden":true,"merged":[[1,3,1,7],[3,13,3,15]]}
["State/Region",{"$f":"+INDEX('Selected Options'!$B$3:$B$39,'Selected Options'!C3)","v":"Arizona"},{"$f":"+INDEX('Selected Options'!$G$23:$G$59,MATCH('Funding & Contributions'!$B$1,'Selected Options'!$F$23:$F$59,0))","v":"09"}]
["Eligible Rates",{"$f":"+INDEX('Selected Options'!$D$3:$D$7,'Selected Options'!E3)","v":"Full Time"},null,"Contributions by Wellness Incentive"]
[{"$f":"+'Selected Options'!F1","v":"Coverage Level"},{"$f":"+INDEX('Selected Options'!$F$3:$F$10,'Selected Options'!G3)","v":"Employee Only"},null,{"$f":"+'Selected Options'!D3","v":"Full Time"},{"$f":"+'Selected Options'!D4","v":"Part Time"},{"$f":"+'Selected Options'!D5","v":"Opt 2"},{"$f":"+'Selected Options'!D6","v":"Opt 3"},{"$f":"+'Selected Options'!D7","v":"Opt 4"},"Flows from selected options wellness incentives"]
[null,null,"Incentive Per Month",0,0,0,0,0,"Input monthly incentive"]
[null,"Funding Rates","Annual HSA",{"$f":"+CONCATENATE(B2,\" Contributions Per Week\")","v":"Full Time Contributions Per Week"},{"$f":"+CONCATENATE(E3,\" Contributions Per Month\")","v":"Part Time Contributions Per Month"},{"$f":"+CONCATENATE(F3,\" Contributions Per Month\")","v":"Opt 2 Contributions Per Month"},{"$f":"+CONCATENATE(G3,\" Contributions Per Month\")","v":"Opt 3 Contributions Per Month"},{"$f":"+CONCATENATE(H3,\" Contributions Per Month\")","v":"Opt 4 Contributions Per Month"},null,null,null,"Full Time","Full Time","Full Time","Full Time","Full Time","Part Time","Part Time","Part Time","Part Time","Part Time"]
["Buy-Up",null,null,null,null,null,null,null,null,null,null,"09",9.5,10,10.5,11,"09",9.5,10,10.5,11]
["Employee Only",null,null,{"$f":"+INDEX($L7:$U7,MATCH($C$1&$B$2,$L$6:$U$6&$L$5:$U$5,0))","v":111.86},null,null,null,null,null,null,null,111.86,111.86,111.86,111.86,111.86,201.55,201.55,201.55,201.55,201.55]
["EE + Spouse",null,null,{"$f":"+INDEX($L8:$U8,MATCH($C$1&$B$2,$L$6:$U$6&$L$5:$U$5,0))","v":343.17900000000003},null,null,null,null,null,null,null,343.17900000000003,362.24449999999996,381.31,400.37550000000005,419.44100000000003,366.73200000000003,387.10599999999999,407.48,427.85400000000004,448.22800000000007]
["EE + Child(ren)",null,null,{"$f":"+INDEX($L9:$U9,MATCH($C$1&$B$2,$L$6:$U$6&$L$5:$U$5,0))","v":236.79900000000001},null,null,null,null,null,null,null,236.79900000000001,249.9545,263.11,276.26550000000003,289.42100000000005,309.15899999999999,326.33449999999999,343.51,360.68549999999999,377.86100000000005]
[]
["EE + Family",null,null,{"$f":"+INDEX($L11:$U11,MATCH($C$1&$B$2,$L$6:$U$6&$L$5:$U$5,0))","v":379.99800000000005},null,null,null,null,null,null,null,379.99800000000005,401.10899999999998,422.22,443.33100000000007,464.44200000000006,447.17400000000004,472.017,496.86,521.70300000000009,546.54600000000005]
["Core"]
[{"$f":"+A7","v":"Employee Only"},null,null,{"$f":"+INDEX($L13:$U13,MATCH($C$1&$B$2,$L$6:$U$6&$L$5:$U$5,0))","v":34.700000000000003},null,null,null,null,null,null,null,34.700000000000003,34.700000000000003,34.700000000000003,34.700000000000003,34.700000000000003,144.04,144.04,144.04,144.04,144.04]
[{"$f":"+A8","v":"EE + Spouse"},null,null,{"$f":"+INDEX($L14:$U14,MATCH($C$1&$B$2,$L$6:$U$6&$L$5:$U$5,0))","v":165.726},null,null,null,null,null,null,null,165.726,174.93299999999999,184.14,193.34699999999998,202.554,256.779,271.04449999999997,285.31,299.57550000000003,313.84100000000001]
[{"$f":"+A9","v":"EE + Child(ren)"},null,null,{"$f":"+INDEX($L15:$U15,MATCH($C$1&$B$2,$L$6:$U$6&$L$5:$U$5,0))","v":83.007000000000005},null,null,null,null,null,null,null,83.007000000000005,87.618499999999997,92.23,96.841500000000011,101.45300000000002,187.72200000000001,198.15100000000001,208.58,219.00900000000001,229.43800000000005]
[]
[{"$f":"+A11","v":"EE + Family"},null,null,{"$f":"+INDEX($L17:$U17,MATCH($C$1&$B$2,$L$6:$U$6&$L$5:$U$5,0))","v":222.35400000000001},null,null,null,null,null,null,null,222.35400000000001,234.70699999999999,247.06,259.41300000000001,271.76600000000002,320.70599999999996,338.52299999999997,356.34,374.15699999999998,391.97399999999999]
["HDHP"]
[{"$f":"+A7","v":"Employee Only"},null,1E-3,{"$f":"+INDEX($L19:$U19,MATCH($C$1&$B$2,$L$6:$U$6&$L$5:$U$5,0))","v":7.77},null,null,null,null,null,null,null,7.77,7.77,7.77,7.77,7.77,83.27,83.27,83.27,83.27,83.27]
[{"$f":"+A8","v":"EE + Spouse"},null,1E-3,{"$f":"+INDEX($L20:$U20,MATCH($C$1&$B$2,$L$6:$U$6&$L$5:$U$5,0))","v":107.244},null,null,null,null,null,null,null,107.244,113.202,119.16,125.11799999999999,131.07599999999999,245.27699999999999,258.90349999999995,272.52999999999997,286.15649999999999,299.78300000000002]
{"$rows_left_out":24}
{"sheet":"Selected Options","index":5,"n_rows":59,"n_cols":28,"rows_kept":59,"cut":false,"hidden":true,"merged":[]}
[null,"Employee Group","Selected","Wellness Incentives","Selected","Coverage Level","Selected","Expected Utilization","Selected","HSA Rollover"]
[null,null,null,null,null,null,null,null,null,null,null,null,{"$f":"+H3","v":"N/A"},{"$f":"+H4","v":"Low"},{"$f":"+H5","v":"Average"},{"$f":"+H6","v":"High"}]
[null,"Arizona",1,"Full Time",1,"Employee Only",1,"N/A",1,{"$f":"+Calculator!Q9","v":0},null,"Services"]
[null,"California",null,"Part Time",null,"EE + Spouse",null,"Low",null,null,null,"PCP",0,1,3,6]
[null,"Colorado",null,"Opt 2",null,"EE + Child(ren)",null,"Average",null,null,null,"SCP",0,1,2,4]
[null,"Connecticut",null,"Opt 3",null,"EE + Family",null,"High",null,null,null,"Lab/X-ray",0,1,2,4]
[null,"District of Columbia",null,"Opt 4",null,null,null,null,null,null,null,"IP",0,0,0,0]
[null,"Delaware",null,null,null,null,null,null,null,null,null,"OP",0,0,0,1]
[null,"Florida",null,null,null,null,null,null,null,null,null,"ER",0,0,0,0]
[null,"Georgia",null,null,null,null,null,null,null,null,null,"Other Costs"]
["Input the client specific information into the cells.  These populate the dropdown boxes on the calculator.  HRA/HSA rollover pulls over from the amount entered in the calculator (if applicable).","Illinois",null,null,null,null,null,null,null,null,null,"Rx"]
[null,"Indiana",null,null,null,null,null,null,null,null,null,"Tier 1",0,3,6,12]
[null,"Iowa",null,null,null,null,null,null,null,null,null,"Tier 2",0,2,4,8]
[null,"Kentucky",null,null,null,null,null,null,null,null,null,"Tier 3",0,0,0,2]
[null,"Louisiana"]
[null,"Maryland"]
[null,"Massachusetts"]
[null,"Minnesota"]
[null,"Missouri"]
[null,"New Hampshire"]
{"$rows_left_out":40}
{"sheet":"Allowed Costs","index":6,"n_rows":16,"n_cols":2,"rows_kept":16,"cut":false,"hidden":true,"merged":[]}
[]
[null,"Assumed cost per Service"]
["Services"]
["PCP",140]
["SCP",225]
["Lab/X-ray",500]
["IP",15000]
["OP",4000]
["ER",2000]
["Rx"]
["Tier 1",35]
["Tier 2",300]
["Tier 3",350]
["Telemedicine",39]
[]
["Enter the allowed amounts in the green highlighted cells."]

{"sheet":"Client Notes","index":7,"n_rows":4,"n_cols":1,"rows_kept":4,"cut":false,"hidden":true,"merged":[]}
["Notes:"]
[]
["Fix HDHP plan to be aggregate deductible with Embedded OOPM"]
["Get contributions"]